Gdb Configure Error No Termcap Library Found

"No Library Found" Fix (Kontakt) - CyX The SenZei

RECOMMENDED: If you have Windows errors then we strongly recommend that you download and run this (Windows) Repair Tool.

CVE (version 20061101) and Candidates as of 20170828 Candidates must be reviewed and accepted by the CVE Editorial Board before they can be added to the official CVE.

config.status: error: cannot find input file: src/Makefile.in configure.ac: no proper invocation of AM_INIT_AUTOMAKE was found. configure.ac: warning: macro ‘AM_CXXFLAGS’ not found in library. opening /dev/mixer error: termcap.h:.

Hi: I am trying to build gdb on Fedora 14. I get an error: "no termcap library found" I have not been able to find a good answer by Googling.

Jul 4, 2014. library found; disabling TUI checking for library containing tgetent. no configure: error: no termcap library found make[3]: *** [configure-gdb].

Mar 1, 2011. From apt-get or aptitude there's just termcap-compact, but I still see "no termcap library found" when trying to install my software (a development.

using BFD version 2.15 configure: error: no termcap library found make[1]: *** [configure-gdb] Error 1 make: *** [all] Error 2

Oct 18, 2012. In order to use libraries from another directories, you can try to do the following:. termcap-1.3.1/configure –host=powerpc-7450-linux-gnu.

[SOLVED] Cross-compilation shows>error: no termcap library found. – I'm experiencing a frustrating error trying to cross-compile gdbserver for. error: no termcap library found make[1]: *** [configure-gdb] Error 1.

shows it’s a shared library. First, I need to launch gdb so that we’re executing the program live: (gdb) b *doupdate + 289 No symbol table is loaded. Use the "file" command. Oops. I wanted to show this error to explain why we often.

Appendix M. Sample.bashrc and.bash_profile Files. The ~/.bashrc file determines the behavior of interactive shells. A good look at this file can lead to a.

000001159 – How to Reindex Vault on Windows. 000001575 – How to resolve "COM+ Activation failed" errors in web applications – MapXtreme.NET. 000001576 – How to.

Error Code 2708 Original Title: Error code 2503/2502. I had to restore my computer to factory settings, and after I did this I now get error code 2503 and/or 2502 when trying to. Safe Boot Disk0s2 I/o Error After shutdown the pc last night, Can’t boot normally! I don’t change anything about kexts. but mac partition don’t seems

The GnuCOBOL FAQ, How To, and COBOL cookbook

gdserver cross compilation failed => error: no termcap. no configure: error: no termcap library found. Most likely you have to tell the gdb configure where to.

Linux man pages: alphabetic list of all pages. Jump to letter:. 3 a b c d e f g h i j k l m n o p q r s t u v w x y z

Error – I am getting "no termcap library found " while installing GNU GDB Debugger in my server. [root gdb-6.8]# cat /etc/redhat-release Red Hat Enterprise Linux Server release 5.1 (Tikanga) [root gdb-6.8]# I have checked the termcap.

Oct 7, 2010. configure: error: no termcap library found. Recently when I was trying to build gdbserver for embedded Linux running on MIPS target, I kept.

configure: error: No curses/termcap library found Can you guide me on how to resolve the above error and how to configure mysql for ti sdk6. I tried to execute./configure and it has generated Makefile properly, but when I give.

make and then failed with: configure: error: no termcap library found, but that termcap lib is just there, why can't make find it? checking for library containing.

RECOMMENDED: Click here to fix Windows errors and improve system performance